GpIdNumber,SerialNo,Age,Gender,SibRelationship,DateOfBirth,Forename,Surname,AddressLine1,AddressLine2,AddressLine3,AddressLine4,PostCode,DateOf3rdMailer,DateOf4thMailer,DateOfReply,AnswersToQuestions1st,Height1st,PresentWeight1st,HighestWeight1st,PScore1st,EScore1st,NScore1st,LScore1st,PBlankDouble1st,EBlankDouble1st,NBlankDouble1st,LBlankDouble1st,Title,DateOfRemoval,AccraBatchNo1st,Height1stUnits,PresentWeight1stUnits,HighestWeight1stUnits,DateChecked,DateOfSelectedSibMailer,DateOfReplyToSwab,SwabAccraBatchNo,SwabPScore,SwabEScore,SwabNScore,SwabLScore,SwabPBlankDouble,SwabEBlankDouble,SwabNBlankDouble,SwabLBlankDouble,SwabAnswersToQuestions,SwabHaveYouEver,SwabInterest,SwabAppetite,SwabEnjoy,SwabGainWeight,SwabFidgety,SwabTired,SwabSleeping,SwabMoreSleep,SwabConcentrating,SwabWorthless,SwabDeath,SwabSymptonsOccured,SwabAgeWhenOccured,SwabInterfere,SwabTreatment,SwabCanWeContactYouAgain,SwabCanWeContactYouAgain1st,DateOfSelectedSibReminder
1,8,47,0,4,"","MARGARET","CLEVELY","GARDEN COTTAGE ALVESTON LODGE","ALVESTON","STRATFORD UPON AVON","","CV377QT","12/05/97 00:00:00","","01/08/98 00:00:00","NYYNYYYYYYYYNNNYYYYNYNYYNNYYNNNNNYYNYYYNNYNYNNYYNNNYYNNYYYYNYNNNNNNYNNYYYNNNNNNYYYNYYYNYNY",564,91,4,0,8,15,5,0,0,0,0,"","",21082,3,3,3,"02/20/98 00:00:00","","","","","","","","","","","","","","","","","","","","","","","","","","","","","","",""
1,12,0,1,5,"","MARTIN","ADAMS","22 BIRCHFIELD CLOSE","BLACKBIRD LEYS","OXFORD","","","12/05/97 00:00:00","","","",,,,,,,,,,,,"","",,,,,"","","","","","","","","","","","","","","","","","","","","","","","","","","","","","","",""
1,12,38,0,4,"","MARION","KETTLE","OXFORD ROAD","KIDLINGTON","OXFORD","","","12/05/97 00:00:00","","01/09/98 00:00:00","YNYNYYNNYNYYYYYNYNYYNNNNYNNNNNNYNNYYYNNNNNNNYNNNYNNYYNYNYNYYYNNYNYYYNYYYNNNNNNNYNYNYYYNYYY",501,80,0,3,18,10,18,0,0,0,0,"","",21105,3,3,0,"02/20/98 00:00:00","","","","","","","","","","","","","","","","","","","","","","","","","","","","","","",""
1,32,40,1,4,"","KEVIN","PEACH","30 WAYNEFLEET ROAD","BARTON","HEADINGTON","","","12/05/97 00:00:00","","01/09/98 00:00:00","YYYYYNNNYYYYYBNNYNYYYNYNYNNNNNNYNNYYYYNYNNNYYYYNYYNYYNNNYYYNYYNNNNYNYYYNYNNNNYNYYYNYYYNYYY",0,0,0,5,16,11,13,0,1,0,0,"","",21101,2,0,0,"","","","","","","","","","","","","","","","","","","","","","","","","","","","","","","",""
1,33,0,0,4,"","PARVEEN","AKHTAR","47 WILSHAM ROAD","","ABINGDON","","OX145LE","12/18/97 00:00:00","","","",,,,,,,,,,,,"","",,,,,"","","","","","","","","","","","","","","","","","","","","","","","","","","","","","","",""
1,33,0,1,5,"","MAHMOOD","AKHTAR","251 ABINGDON ROAD","","OXFORD","","","12/18/97 00:00:00","","","",,,,,,,,,,,,"","",,,,,"","","","","","","","","","","","","","","","","","","","","","","","","","","","","","","",""
1,38,0,0,5,"","PATRICK","CHAPMAN","65 SPENCER CRESCENT","ROSE HILL","OXFORD","","","01/17/98 00:00:00","","","",,,,,,,,,,,,"","",21101,,,,"","","","","","","","","","","","","","","","","","","","","","","","","","","","","","","",""
1,38,0,0,6,"","LESLIE","CHAPMAN","67 GIBBS CRESCENT","MILL STREET","OXFORD","OXFORDSHIRE","OX20NY","01/17/98 00:00:00","","","",,,,,,,,,,,,"","",21101,,,,"","","","","","","","","","","","","","","","","","","","","","","","","","","","","","","",""
1,38,46,1,7,"","WILLIAM","CHAPMAN","11 COTMAN CLOSE","","ABINGDON","OXFORDSHIRE","","01/17/98 00:00:00","","02/10/98 00:00:00","NYNNYYYYYYYNYYNNYYNNNNNYYNYNNNNYNNNYYNNYNNNYYNNYYYYYYNNYYYYYYNNYNNYYNYYNNNNNNNYNNYNNNYNNYY",506,10,1100,3,20,4,11,0,0,0,0,"","",21293,2,0,0,"","","","","","","","","","","","","","","","","","","","","","","","","","","","","","","",""
1,38,47,0,4,"","KATHLEEN","FARQUHAR","85 KIRKHILL ROAD","TORRY","ABERDEEN","","","01/17/98 00:00:00","","02/10/98 00:00:00","NYYNNYYNYNYYNYYYDYYNYNYNNNYNYNYNNYYNYYNYYYNNNNYYYNYNYYNNYYNNYYYNNYNYYNYYYNYYYYNYNYNNNNNNYY",411,10,1107,1,4,21,12,0,1,0,0,"","",21287,3,3,3,"","","","","","","","","","","","","","","","","","","","","","","","","","","","","","","",""
1,43,0,1,4,"","JOHN","WEST","6 MEADS CLOSE","DRAYTON","ABINGDON","","","12/05/97 00:00:00","","","",,,,,,,,,,,,"","",,,,,"","","","","","","","","","","","","","","","","","","","","","","","","","","","","","","",""
1,69,42,0,4,"","FIONA","GARINER","ELM HOUSE","WOODCROFT CLOSE","WOODCROFT   CHEPSTOW","","","12/05/97 00:00:00","","01/08/98 00:00:00","YNYNYYYYYYYYNYNNYYYNNNYYYNYNNNNYNYYNYYYYYNNYYNYYYNNYYYYYYNNYYNNYNYYYNYYYYYYNNNNYYYNYYYNNNY",502,9,1105,3,20,17,9,0,0,0,0,"","",20967,3,3,3,"","","","","","","","","","","","","","","","","","","","","","","","","","","","","","","",""
1,71,37,0,4,"","VIKI","ALLAN","34 COPE BANK","SMITHILLS","BOLTON","","BL16DR","12/05/97 00:00:00","","03/14/98 00:00:00","NYNNNYYNYNYNYYNNNYYNYNNNNNNNYNNNNNNNNNYNNNYYNNNYNNYNYNNNYNNNYNNYNNYNNNYNYNNNNNNYYNNNYNNYYY",510,11,1107,3,3,4,10,0,0,0,0,"","",22266,3,3,3,"","","","","","","","","","","","","","","","","","","","","","","","","","","","","","","","01/01/00 00:00:00"
1,71,49,0,6,"","JUDY","ALLAN","THE BARN FLAT  CHURCH STREET","SUTTON COURTENAY","ABINGDON","","OX136QA","12/05/97 00:00:00","","01/09/98 00:00:00","YYNNNYNYYNYNYNYNNYNNYNNYNNNYYNNNNNNNYNYNNYNYNNNYNNYYYNNNYYNNYNYYNYNNNNYNYNYNNNNNYNNYYNNNYY",505,9,912,0,3,5,6,0,0,0,0,"","",21099,3,3,0,"","","","","","","","","","","","","","","","","","","","","","","","","","","","","","","","01/01/00 00:00:00"
1,71,52,0,5,"","BRIDGET","CHAMBERS","MIDDLE COTTAGE","WYRE PIDDLE","PERSHORE","","WR102JD","12/05/97 00:00:00","","01/08/98 00:00:00","YYNNNYNNYNYYYYNNNYYNYNNYYNNNYNYNNYNNYYYNNYNNNNNYYNYNYNNNYYYYYNYYNNNNNNYYYNNNNYNYYYNNYNNYNY",504,90,1000,0,7,9,8,0,0,0,0,"","",21082,3,3,3,"","","","","","","","","","","","","","","","","","","","","","","","","","","","","","","","01/01/00 00:00:00"
1,73,0,1,4,"","PHILLIP","BYCROFT","6 RIVY CLOSE","ABINGDON","OXON","","OX14","12/05/97 00:00:00","","","",,,,,,,,,,,,"","",,,,,"","","","","","","","","","","","","","","","","","","","","","","","","","","","","","","",""
1,74,0,1,5,"","GEOFFREY","ALLAN","17 HILLVIEW ROAD","OXFORD","","","","12/05/97 00:00:00","","","",,,,,,,,,,,,"","",,,,,"","","","","","","","","","","","","","","","","","","","","","","","","","","","","","","",""
1,74,46,0,4,"","JEAN","MASON","2 PINE CLOSE","EARSINGTON","OXFORD","","OX99BS","12/05/97 00:00:00","","01/08/98 00:00:00","NYYNNYYNYNYYYNNNNYYNYNNNNNNNYNNYNYNNYNNNNYNNNNNYYYNYYNNNNNNNYYNNNNNNYNYYYYNNNNNNYNNYYNNNYY",504,80,6,3,3,8,12,0,0,0,0,"","",21082,3,3,3,"","","","","","","","","","","","","","","","","","","","","","","","","","","","","","","",""
1,81,0,0,5,"","JANE","GROSER","27 PERNE AVENUE","","CAMBRIDGE","","CB13RY","12/05/97 00:00:00","","","",,,,,,,,,,,,"","",,,,,"","","","","","","","","","","","","","","","","","","","","","","","","","","","","","","",""
1,81,30,1,4,"","JOHN","ALLEN","14 HANLEY ROAD","","LONDON","","N43DR","12/05/97 00:00:00","","01/08/98 00:00:00","NYYNYNYYYNYYNYYNYNYNNNYNYNYNNNNYNYYNNNYYNYYYNNYYYNNYYNNNYYYNYYYNNNYNNNYYNNNNNYYYNYNNYYNYYY",600,11,1113,6,12,14,11,0,0,0,0,"","",20971,3,3,3,"","","","","","","","","","","","","","","","","","","","","","","","","","","","","","","",""
1,101,0,0,4,"","GEORGINA","ASHWIN","25 KINGSFIELD CRESCENT","WITNEY","OXFORD","","","12/05/97 00:00:00","","","",,,,,,,,,,,,"","",,,,,"","","","","","","","","","","","","","","","","","","","","","","","","","","","","","","",""
1,104,0,0,4,"","MURIEL","WILL","5 HANDSIDE LANE","","WELWYN GARDEN CITY","","AL86SE","12/05/97 00:00:00","","","",,,,,,,,,,,,"","",,,,,"","","","","","","","","","","","","","","","","","","","","","","","","","","","","","","",""
1,108,0,0,4,"","BERNICE","HUNTER","212 CUMNOR ROAD","BOARS HILL","OXFORD","","","12/18/97 00:00:00","","","",,,,,,,,,,,,"","",,,,,"","","","","","","","","","","","","","","","","","","","","","","","","","","","","","","",""
1,121,38,1,4,"","KEVIN","BEAUMONT","PO BOX 95519","MOMBASA","KENYA","","","12/05/97 00:00:00","","05/20/98 00:00:00","NYYYNYYYYNYYNNYYNYYNYNYYNNYYNNNNNYNNYYYNNYNYNNYYNNYNYYYNYYYNYYYYYYNYYNYYYNNNYNNYYNNYYNNYNY",180,80,93,1,2,20,1,0,0,0,0,"","",23094,2,0,0,"","","","","","","","","","","","","","","","","","","","","","","","","","","","","","","",""
1,121,41,0,6,"","ELAINE","SCHWARZ","56 BAYTREE ROAD","FAIRFIELD PARK","BATH","","","12/05/97 00:00:00","","01/09/98 00:00:00","NYYNNYYNYYYYNYNYNYYNYNYNNNYNNNNYNNNYYNNNNYNYNNNNYNNNYNYNNNYYYNNYNNYNNNYYNNNNNNNYYYNYYNNNNY",51,10,10,2,9,9,11,0,0,0,0,"","",21089,3,3,0,"","","","","","","","","","","","","","","","","","","","","","","","","","","","","","","",""
1,121,70,0,5,"","JACQUELINE","EYLES","30 PENNARD GREEN","TWERTON","BATH","","","12/05/97 00:00:00","","01/08/98 00:00:00","YNYNNYYYYYYYYYNNYYYYYNYNYNNNNNNYNNNNYYNYNNYYYNNNNNYYYYNNYYYNYYNNNYNYYNNNYNNNNNNYNYNNYBNYYY",507,11,1300,3,12,13,11,0,1,0,0,"","",20987,0,0,0,"","","","","","","","","","","","","","","","","","","","","","","","","","","","","","","",""
1,132,0,1,4,"","PAUL","ANNELLS","3 SPENLOVE CLOSE","","ABINGDON","","OX141YE","12/18/97 00:00:00","","","",,,,,,,,,,,,"","",20590,,,,"","","","","","","","","","","","","","","","","","","","","","","","","","","","","","","",""
1,133,0,0,5,"","YVONNE","AUSTIN","60 SANOR WAY","DIDCOT","OXON","","","12/05/97 00:00:00","","","",,,,,,,,,,,,"","",,,,,"","","","","","","","","","","","","","","","","","","","","","","","","","","","","","","",""
1,133,27,0,4,"","ADELE","SEYMOUR","8 CARLTON CLOSE","GROVE","WANTAGE","","OX120PU","12/05/97 00:00:00","","01/09/98 00:00:00","YYNNYYYYYYYYNYNNYYYNNNYYYNNNNNNYNNNYYNYNNNNNNNNYYNYYYNNYYYYYYYNNNYNNYNYNYNNNYNNYYYNYYYNYYY",506,8,1102,0,17,11,6,0,0,0,0,"","",21099,3,3,3,"","","","","","","","","","","","","","","","","","","","","","","","","","","","","","","",""
1,136,0,1,4,"","PETER","ANNELLS","34 WESTERN AVENUE","CAVENDISH PARK","DIDCOT","","","12/05/97 00:00:00","","","",,,,,,,,,,,,"","",,,,,"","","","","","","","","","","","","","","","","","","","","","","","","","","","","","","",""
1,138,0,0,4,"","ANN","JOHNSON","27 SAINT PETERS ROAD","","ABINGDON","","OX143SJ","12/05/97 00:00:00","","","",,,,,,,,,,,,"","",,,,,"","","","","","","","","","","","","","","","","","","","","","","","","","","","","","","",""
1,138,0,0,5,"","JANET","SIMPSON","1 ELWES CLOSE","","ABINGDON","","OX143UY","12/05/97 00:00:00","","","",,,,,,,,,,,,"","",,,,,"","","","","","","","","","","","","","","","","","","","","","","","","","","","","","","",""
1,138,40,0,6,"","JILL","HENLEY","21 ASHGATE","","ABINGDON","","OX145NF","12/05/97 00:00:00","","01/08/98 00:00:00","YYYNYYYNYNYNYYYYYYYNNNYNYNYYNNYYNYNNYYYNYNNYNNYYYNYYYNNNNYNNYYYYNNNYYNYNYYYNYYNYYNNYYNNYYY",502,9,1506,2,12,19,7,0,0,0,0,"","",20984,3,3,3,"","","","","","","","","","","","","","","","","","","","","","","","","","","","","","","",""
1,141,32,0,4,"","SUSAN","ORGAN","22 CROSSWAYS","LINTON","CAMBRIDGE","","CB16NQ","12/18/97 00:00:00","","02/10/98 00:00:00","YYNNNYNNYNYNYYNNYYYYYNNNYNNNNNNYNYYNYYNNNYNNNNNYNNNYYNNNYNNNYNNYNNNNNNYYNNNNNNNYNNNNYNNNYY",505,8,810,0,8,5,17,0,0,0,0,"","",21262,3,3,3,"","","","","","","","","","","","","","","","","","","","","","","","","","","","","","","",""
1,146,0,1,4,"","MARTIN","ARIAS","AV. CONSTITUYENTE 1493","MONTEVIDEO","URUGUAY","","11100","12/18/97 00:00:00","","","",,,,,,,,,,,,"","",,,,,"","","","","","","","","","","","","","","","","","","","","","","","","","","","","","","",""
1,146,0,1,5,"","FRANCISCO","ARIAS","AV. RONDEAU 1643","MONTIVIDEO","URUGUAY","","11100","12/18/97 00:00:00","","","",,,,,,,,,,,,"","",,,,,"","","","","","","","","","","","","","","","","","","","","","","","","","","","","","","",""
1,146,0,1,6,"","LAVRO","ARIAS","AV. RONDEAU 1643/202","MONTEVIDEO","URUGUAY","","11100","12/18/97 00:00:00","","","",,,,,,,,,,,,"","",,,,,"","","","","","","","","","","","","","","","","","","","","","","","","","","","","","","",""
1,146,36,1,7,"","IGNACIO","ARIAS","OBERDORF STR. 57","LANFELDEN-ECHTERDINGEN","GERMANY","","70771","12/18/97 00:00:00","","02/08/98 00:00:00","NYNNNYNBNNYNYYNNNYYYYNNYNNNNYNNNNNYYYNYNNYNNNNNNYNYNYNYYYNNNYNNNNNYNNNYNYNNNNYNYNNNNYNNYNY",171,62,6500,2,4,3,14,0,0,0,1,"","",21238,2,0,0,"","","","","","","","","","","","","","","","","","","","","","","","","","","","","","","",""
1,149,0,1,4,"","KENNETH","TASKER","1296 HELLER DRIVE","YARDLEY","PENNSYLVANIA 19067","","","12/18/97 00:00:00","","","",,,,,,,,,,,,"","",20553,,,,"","","","","","","","","","","","","","","","","","","","","","","","","","","","","","","",""
1,149,59,0,5,"","JUDITH","WATERS","16 BAILEY DALE","STANWAY","COLCHESTER","","CO35LB","12/18/97 00:00:00","","02/08/98 00:00:00","YYYNNYYYYNYYYNYYYYYNYNYNYNYYNNYNNYYNYNYNYYNNNNYYNNYNYNYNYYYYYNNYYNNYNNYYYYYNNNNYYYNYYNYYNY",543,90,905,3,7,18,8,0,0,0,0,"","",21238,3,0,3,"","","","","","","","","","","","","","","","","","","","","","","","","","","","","","","",""
1,152,0,0,4,"","SUSAN","SHERRIFF","1 MARYLANDS","CHISELHAMPTON","OXON","","","12/05/97 00:00:00","","","",,,,,,,,,,,,"","",,,,,"","","","","","","","","","","","","","","","","","","","","","","","","","","","","","","",""
1,162,0,1,4,"","JONATHAN","COLEY","19 BLACKLANDS ROAD","BENSON","OXON","","","12/18/97 00:00:00","","","",,,,,,,,,,,,"","",20553,,,,"","","","","","","","","","","","","","","","","","","","","","","","","","","","","","","",""
1,162,0,1,5,"","SIMON","COLEY","ASH HOUSE","37 WEST DRIVE","SONNING ON THAMES","","RG40GE","12/18/97 00:00:00","","","",,,,,,,,,,,,"","",20553,,,,"","","","","","","","","","","","","","","","","","","","","","","","","","","","","","","",""
1,166,0,0,4,"","LYNNE","FINDLAY","108 MANORFIELD RC SCHOOL","SAINT PAULS WOOD HILL","ORPINGTON","","BR52SR","12/05/97 00:00:00","","","",,,,,,,,,,,,"","",,,,,"","","","","","","","","","","","","","","","","","","","","","","","","","","","","","","",""
1,171,0,0,4,"","CHERYL","ASKER","21 VENFORD CLOSE","HOOKHILLS","DAIGNTON","","","12/18/97 00:00:00","","","",,,,,,,,,,,,"","",20553,,,,"","","","","","","","","","","","","","","","","","","","","","","","","","","","","","","",""
1,176,41,1,5,"","TIMOTHY","COOMBES","20 GARFORD CLOSE","","ABINGDON","","OX142BY","12/18/97 00:00:00","","01/18/98 00:00:00","NYNNYYNYNNYNYNNNYYYNYNNYNNNNNNNYNNNYYNYNNNNYNNNYYNYYNYNYYYYYYNNNNNNNYNYYYNNNNNNYNNNYYNNYYY",510,16,1607,2,10,7,7,0,0,0,0,"","",21173,3,3,3,"","","","","","","","","","","","","","","","","","","","","","","","","","","","","","","",""
1,176,44,0,4,"","DAWN","COOMBES","118 GAINSBOROUGH GREEN","ABINGDON","OXON","","","12/18/97 00:00:00","","01/18/98 00:00:00","NYYNNYYYYNYYNNYNNYNNYNYYNNYNYNNNNYNNNNYNNYNYNNNYNNNNYYNNYYNNYYNNNNNNNNYYNNNYYNNNYYNYYNNNYY",58,15,1809,2,1,13,9,0,0,0,0,"","",21178,3,3,3,"","","","","","","","","","","","","","","","","","","","","","","","","","","","","","","",""
1,177,0,0,4,"","DIANA","TAYLOR","13 CUMNOR ROAD","LOWER WOOTTON","BOARS HILL","","","12/05/97 00:00:00","","","",,,,,,,,,,,,"","",,,,,"","","","","","","","","","","","","","","","","","","","","","","","","","","","","","","",""
1,177,0,1,5,"","THOMAS","MANN","21 GLASTONBURY COURT","","YEOVIL","","BA213TW","12/05/97 00:00:00","","","",,,,,,,,,,,,"","",,,,,"","","","","","","","","","","","","","","","","","","","","","","","","","","","","","","",""
1,177,0,1,6,"","DERRICK","MANN","41 WHITEHORNS WAY","DRAYTON","ABINGDON","","","12/05/97 00:00:00","","","",,,,,,,,,,,,"","",,,,,"","","","","","","","","","","","","","","","","","","","","","","","","","","","","","","",""
1,177,0,1,7,"","PETER","MANN","10 HAWKINS WAY","WOOTTON","ABINGDON","","","12/05/97 00:00:00","","","",,,,,,,,,,,,"","",,,,,"","","","","","","","","","","","","","","","","","","","","","","","","","","","","","","",""
1,192,45,1,4,"","KIM","BAILES","CHERINGTON THE DOWNS ROAD","STANDLAKE","WITNEY","","OX87TB","12/05/97 00:00:00","","01/18/98 00:00:00","YYYNNYYYYNYYNYNYYYYNYYYYNNYYYNYNNYNNYNYNYYNYNYNYYYNYYYNYYYYYYYYYNNNYYNYNYNYNYNYYYYNYYYYYNY",601,80,85,5,10,18,2,0,0,0,0,"","",21178,3,0,0,"","02/04/00 00:00:00","10/29/00 00:00:00","29586","3","6","19","2","0","0","0","0","YYYYYYYYYNYYNNYYNYYNYYYYNNYYYNYNNYNNYNYNYYNYNYNYYYNNYYYNYYYNYYYYNNNYYNYNYNYNYNNYYYNYYYNYNY","3","Y","Y","Y","N","Y","Y","Y","N","Y","Y","M","2","43","1","1","","Y","10/28/00 00:00:00"
1,195,43,1,4,"","NICHOLAS","BOURNE","3 DALE ROAD","SUNBURY ON THAMES","MIDDLESEX","","","12/05/97 00:00:00","","01/09/98 00:00:00","YYNNNYNYYNYNYNNNYYNYYNNYNNNNYNNYNNYYYNNNNYNNNNYYNNNNYNNNYNYYYNNYNNNNYNYYYNNNNYNYYNNNNNYNYY",507,16,1107,1,6,3,13,0,0,0,0,"","",21102,3,3,3,"","","","","","","","","","","","","","","","","","","","","","","","","","","","","","","",""
1,195,45,1,5,"","PHILIP","BOURNE","20 ELLIS FARM CLOSE","MAYFORD","WOKING","","","12/05/97 00:00:00","","01/08/98 00:00:00","YYYNYYYYYYYYYYYNYYYNNNYNYNYNNNYYNYNNYYNYYNNYYNYYYNYYYYYYYYNYYYYYNNNNYYYNYNYNNNYYYYNYYYYYYY",507,11,1107,2,20,19,9,0,0,0,0,"","",21087,3,3,3,"","","","","","","","","","","","","","","","","","","","","","","","","","","","","","","",""
1,196,55,0,4,"","KATHARINE","OLIVER","7 GREYS CLOSE","","BANBURY","","OX160SW","12/05/97 00:00:00","","01/17/98 00:00:00","YYYNNYYNNNYYYNYNNNNNYNYYNNYNYNNNNYYYYYNNNYNYNYNYNNYNYYYNYNYNYYNYNYNYYNYNYYYNNNYYYNYYYYNYYY",502,11,1106,6,4,16,10,0,0,0,0,"","",21005,3,3,3,"","","","","","","","","","","","","","","","","","","","","","","","","","","","","","","",""
1,198,0,1,4,"","TREVOR","BAINBRIDGE","58 WESTWOOD GLEN","TILEHURST","READING","","RG315NW","12/05/97 00:00:00","","","",,,,,,,,,,,,"","",,,,,"","","","","","","","","","","","","","","","","","","","","","","","","","","","","","","",""
1,199,51,1,4,"","IAN","POTTER","151 BOSTY LANE","ALDRIDGE","WALSALL","","","12/05/97 00:00:00","","01/08/98 00:00:00","NNYNYYNYNYYYNYYNYNNNNNNYYNYNNNNYNNNYYYYYNNYYNYNYYNNYYNYYYNYYYNYYNYYYYNYYYNNNNNNNYYNNYYNNYY",510,79,83,6,18,8,6,0,0,0,0,"","",21006,3,0,0,"","","","","","","","","","","","","","","","","","","","","","","","","","","","","","","",""
1,206,0,1,4,"","KEVIN","BALL","88 ANDESEY WAY","","ABINGDON","","OX145TB","12/05/97 00:00:00","","","",,,,,,,,,,,,"","",,,,,"","","","","","","","","","","","","","","","","","","","","","","","","","","","","","","",""
1,219,0,1,4,"","BRENDON","HANDLEY","79 BREAKENSFIELD","BROOKSIDE","TELFORD","","","12/05/97 00:00:00","","","",,,,,,,,,,,,"","",,,,,"","","","","","","","","","","","","","","","","","","","","","","","","","","","","","","",""
1,219,0,1,5,"","MARSHALL","HANDLEY","79 BREAKENSFIELD","BROOKSHIDE","TELFORD","","","12/05/97 00:00:00","","","",,,,,,,,,,,,"","",,,,,"","","","","","","","","","","","","","","","","","","","","","","","","","","","","","","",""
1,226,0,0,4,"","NATASHA","MATUHINA","ST PETERSBURG","","","","","12/05/97 00:00:00","","","",,,,,,,,,,,,"","",,,,,"","","","","","","","","","","","","","","","","","","","","","","","","","","","","","","",""
1,227,0,1,4,"","SAPANOV","VLADIMIR","ST PETERSBURG","","","","","12/05/97 00:00:00","","","",,,,,,,,,,,,"","",,,,,"","","","","","","","","","","","","","","","","","","","","","","","","","","","","","","",""
1,230,45,1,4,"","BO","BARBESGAARD","SVINGET 5","3450 ALLEROD","DENMARK","","","12/05/97 00:00:00","","01/08/98 00:00:00","YYNNYYDNYYYYYYYNNNNNYNNYNNYYYYNNYNNNNNNNNNYYYNYYYNYNYNYYNYYYYNYYYYNNNNYYYYYYNNNYYNNNYYNYNY",182,71,7800,9,11,10,7,0,0,1,0,"","",21084,2,0,0,"","","","","","","","","","","","","","","","","","","","","","","","","","","","","","","",""
1,231,0,1,4,"","PATRICK","WOODLEY","197 RADLEY ROAD","ABINGDON","OXON","","OX14","12/05/97 00:00:00","","","",,,,,,,,,,,,"","",,,,,"","","","","","","","","","","","","","","","","","","","","","","","","","","","","","","",""
1,231,0,1,5,"","RICHARD","WOODLEY","THE COTTAGE","DENE HOLLOW","CHILTON","","","12/05/97 00:00:00","","","",,,,,,,,,,,,"","",,,,,"","","","","","","","","","","","","","","","","","","","","","","","","","","","","","","",""
1,234,61,0,4,"","NICOLA","GREER","28 THE HEYES","RAVENSHEAD","NOTTINGHAMSHIRE","","","12/05/97 00:00:00","","01/08/98 00:00:00","NYYNNYYYYNYYYNYNYNYNYNYYNNYNYNNNNYYNYNNNNYNNNYYYYNNYYYNNYYYYYYNNNYNYYNYYYNNNYNNYYNNYYNNYYY",504,10,1105,2,4,19,10,0,0,0,0,"","",20953,3,3,3,"","","","","","","","","","","","","","","","","","","","","","","","","","","","","","","",""
1,236,0,0,5,"","PAMELA","SMITH","469 CAROL PLACE","PELHAM MANOR","NEW YORK","","","01/17/98 00:00:00","","","",,,,,,,,,,,,"","",20818,,,,"","","","","","","","","","","","","","","","","","","","","","","","","","","","","","","",""
1,236,0,1,4,"","STEPHEN","HILLS","7 WILDMOOR GATE","ABINGDON","OXON","","","01/17/98 00:00:00","","","",,,,,,,,,,,,"","",20818,,,,"","","","","","","","","","","","","","","","","","","","","","","","","","","","","","","",""
1,236,0,1,6,"","JEFFERY","HILLS","MS189 KINGAROY","QUEENSLAND","AUSTRALIA","","","01/17/98 00:00:00","","","",,,,,,,,,,,,"","",20818,,,,"","","","","","","","","","","","","","","","","","","","","","","","","","","","","","","",""
1,239,0,0,4,"","SUSANNE","ROBINSON","51 CURTIS AVENUE","ABINGDON","OXON","","","12/05/97 00:00:00","","","",,,,,,,,,,,,"","",,,,,"","","","","","","","","","","","","","","","","","","","","","","","","","","","","","","",""
1,241,35,1,4,"","RUSSELL","BARKER-DEVERE","54 HARTLEY ROAD","","LUTON","","LU20HX","12/18/97 00:00:00","","01/18/98 00:00:00","NYYYNYYYYNYYNYYYYYYNYYYYYNYYNNYNNYNNYYYNYYNYNYYYYNYYYYNNYYYNYYYNNNNYYNYYYNYNYNNYYNNYYNNYNY",508,14,1508,2,6,22,0,0,0,0,0,"","",21196,3,3,3,"","","","","","","","","","","","","","","","","","","","","","","","","","","","","","","",""
1,241,39,0,5,"","KAREN","FISHER","73 WAVERLEY AVENUE","","KIDLINGTON","","OX52ND","12/18/97 00:00:00","","02/08/98 00:00:00","YYYYYYYYYYYYNYNNNYYNYNYYYNYNYNYNNYNNYNYNNYNYNNNYYNYYYNNNYYYNYNYYNNNYNNYNYNNYNNNYYNNYYYNYNY",56,61,64,1,9,13,3,0,0,0,0,"","",21230,3,0,0,"","","","","","","","","","","","","","","","","","","","","","","","","","","","","","","",""
1,246,0,0,4,"","ALEXSANDRA","BARNACLE","9 SADLERS COURT","","ABINGDON","","OX142PA","12/05/97 00:00:00","","","",,,,,,,,,,,,"","",,,,,"","","","","","","","","","","","","","","","","","","","","","","","","","","","","","","",""
1,246,0,1,5,"","STUART","BARNACLE","OLD MALT COTTAGE","99 SPRINGFIELD ROAD","GRANTHAM","","NG318AU","12/05/97 00:00:00","","","",,,,,,,,,,,,"","",,,,,"","","","","","","","","","","","","","","","","","","","","","","","","","","","","","","",""
1,248,0,0,4,"","LINDA","GILBERT","84 EDWIN ROAD","DIDCOT","OXON","","","12/05/97 00:00:00","","01/08/98 00:00:00","NNYNYYYYYNYYYNNYYYYYNNYYYNYYYNNYNYNNYYNYNNYYNNYYYNYYYYNYYYNNYYNNNYNNNNNYYNNNYNNYNYNNYNNNYY",0,0,0,3,11,16,9,0,0,0,0,"","",20954,2,0,3,"","06/16/99 00:00:00","01/27/01 00:00:00","33011","1","12","10","10","0","0","0","0","NNNNYYNYYNYNYNYYYYNYNNNYYNYNNNNNNYNNYNNYNNNYNNNYYNYYYNNYYYYYYYNNNYNNNNYYYNNNYYNYNYNNYNNYYY","0","""""","""""","","","","","","","","","","0","0","0","0","","N","01/01/00 00:00:00"
1,248,26,1,5,"","RICHARD","BARNARD","38  GOLDING CLOSE","THATHAM","BERKSHIRE","","RG194SG","12/05/97 00:00:00","","01/09/98 00:00:00","YYYNNYYNYNYYYNNNYYYNYNYYNNYNNNNNNYNNYYYNYYNNNNYYYNYYYYNYYYNNYYYYNYNNNNYYNYYYNNYYNYYNYNYYYY",510,13,1304,5,8,18,11,0,0,0,0,"","",21091,3,3,3,"","06/16/99 00:00:00","","","","","","","","","","","","","","","","","","","","","","","","","","","","","","01/01/00 00:00:00"
1,248,34,1,6,"","ANTHONY","BARNARD","38 LARKHILL","","WANTAGE","","OX128HA","12/05/97 00:00:00","","01/09/98 00:00:00","YYYNYYYYYYYYYYNNYYYNNNYYYNYYNNYYNYNNYYNNYNNYYNYYYNYYYYNYYYYYYYYNNNNYNNYYYNYNYNNYNYNYYYNYYY",510,78,80,0,17,21,7,0,0,0,0,"","",21100,3,0,0,"","06/16/99 00:00:00","","","","","","","","","","","","","","","","","","","","","","","","","","","","","","01/01/00 00:00:00"
1,254,32,0,4,"","BERNADETTE","KING","7 STONEBURGE CRESCENT","","BICESTER","","OX68DN","12/05/97 00:00:00","","01/08/98 00:00:00","YYNNYYNYNYYYYNNYYYYNNNNYNNNYNNNNNYNYYYNYNNNYNNYYNNYYYNNYYNNYYNNNNNNNNNYYYNNNNNNYNNNNYNNYNY",54,13,152,1,12,8,7,0,0,0,0,"","",21004,3,3,3,"","","","","","","","","","","","","","","","","","","","","","","","","","","","","","","",""