GpIdNumber,SerialNo,Age,Gender,SibRelationship,DateOfBirth,Forename,Surname,AddressLine1,AddressLine2,PostCode,DateOf1stMailer,DateOf2ndMailer,DateOf1stReply,AccraBatchNo1st,AnswersToQuestions1st,Height1st,PresentWeight1st,HighestWeight1st,PScore1st,EScore1st,NScore1st,LScore1st,DateOf5thMailer,DateOf6thMailer,DateOf7thMailer,DateOfReplyToSwab,AccraBatchNo2nd,AnswersToQuestions2nd,Height2nd,PresentWeight2nd,HighestWeight2nd,PScore2nd,EScore2nd,NScore2nd,LScore2nd,DateOf10thMailer,DateOfReplyTo10thMailer,DateOf13thMailer,DateOfRemoval,AddressLine3,AddressLine4,PBlankDouble1st,EBlankDouble1st,NBlankDouble1st,LBlankDouble1st,PBlankDouble2nd,EBlankDouble2nd,NBlankDouble2nd,LBlankDouble2nd,NoOfSibsProvided1st,Height1stUnits,PresentWeight1stUnits,HighestWeight1stUnits,Height2ndUnits,PresentWeight2ndUnits,HighestWeight2ndUnits,NoOfSibsProvided2nd,Title,SwabAccraBatchNo,SwabPScore,SwabEScore,SwabNScore,SwabLScore,SwabPBlankDouble,SwabEBlankDouble,SwabNBlankDouble,SwabLBlankDouble,SwabAnswersToQuestions,SwabHaveYouEver,SwabInterest,SwabAppetite,SwabEnjoy,SwabGainWeight,SwabFidgety,SwabTired,SwabSleeping,SwabMoreSleep,SwabConcentrating,SwabWorthless,SwabDeath,SwabSymptonsOccured,SwabAgeWhenOccured,SwabInterfere,SwabTreatment,SwabParentsProvided,SwabCanWeContactYouAgain,SwabCanWeContactYouAgain1st,DateOfSelectedSibReminder
1,0,48,0,1,"03/01/49 00:00:00","SUSAN M","ABBOTT","67 HAWKINS WAY","WOOTTON","OX136LA","09/11/97 00:00:00","","",,"",,,,,,,,"","","","",,"",,,,,,,,"","","","","","",,,,,,,,,,,,,,,,,"",,,,,,,,,,"",,"","","","","","","","","","","",,,,,,,"",""
1,1,35,1,1,"10/27/62 00:00:00","YOUSEF ALI","ABEL","108 OXFORD ROAD","ABINGDON","OX142AG","09/11/97 00:00:00","11/05/97 00:00:00","",,"",,,,,,,,"","","","",,"",,,,,,,,"","","","","","",,,,,,,,,,,,,,,,,"",,,,,,,,,,"",,"","","","","","","","","","","",,,,,,,"",""
1,2,38,0,1,"10/06/59 00:00:00","HELEN KIM","ABELA","12 BROOKSIDE","ABINGDON","OX141PD","09/11/97 00:00:00","11/05/97 00:00:00","",,"",,,,,,,,"","","","",,"",,,,,,,,"","","","","","",,,,,,,,,,,,,,,,,"",,,,,,,,,,"",,"","","","","","","","","","","",,,,,,,"",""
1,3,40,0,1,"02/09/57 00:00:00","CAROL ANN","ABREHART","24 FARM ROAD","ABINGDON","OX141LZ","09/11/97 00:00:00","11/05/97 00:00:00","",,"",,,,,,,,"","","","",,"",,,,,,,,"","","","","","",,,,,,,,,,,,,,,,,"",,,,,,,,,,"",,"","","","","","","","","","","",,,,,,,"",""
1,4,43,1,1,"04/25/54 00:00:00","JAMES E","ABREHART","1 FIR TREES","WOODLANDS PARK","OX142LN","09/11/97 00:00:00","11/05/97 00:00:00","",,"",,,,,,,,"","","","",,"",,,,,,,,"","","","","","",,,,,,,,,,,,,,,,,"",,,,,,,,,,"",,"","","","","","","","","","","",,,,,,,"",""
1,5,34,1,1,"04/08/63 00:00:00","JOHN MAURICE","ABSALOM","8C MILTON ROAD","SUTTON COURTENAY","OX144BS","09/11/97 00:00:00","11/05/97 00:00:00","",,"",,,,,,,,"","","","",,"",,,,,,,,"","","","","","",,,,,,,,,,,,,,,,,"",,,,,,,,,,"",,"","","","","","","","","","","",,,,,,,"",""
1,6,45,0,1,"01/25/52 00:00:00","KATHLEEN","ABSALOM","8C MILTON ROAD","SUTTON COURTENAY","OX144BS","09/11/97 00:00:00","11/05/97 00:00:00","",,"",,,,,,,,"","","","",,"",,,,,,,,"","","","","","",,,,,,,,,,,,,,,,,"",,,,,,,,,,"",,"","","","","","","","","","","",,,,,,,"",""
1,7,40,0,1,"02/23/57 00:00:00","KATHLEEN","ABSALOM","37 DARRELL WAY","ABINGDON","OX141HG","09/11/97 00:00:00","11/05/97 00:00:00","",,"",,,,,,,,"","","","",,"",,,,,,,,"","","","","","",,,,,,,,,,,,,,,,,"",,,,,,,,,,"",,"","","","","","","","","","","",,,,,,,"",""
1,8,44,0,1,"03/30/53 00:00:00","JANET LYNNE","ACUTT","15 NORMAN AVENUE","ABINGDON","OX142HQ","09/11/97 00:00:00","","11/05/97 00:00:00",19846,"YYYNYYYNYNYYYNYYYYYNYNYYNNYNNNNYNYYNYYYYNNNNNNYYNNYYYYNNYYYNYNYYNNNYNNYYYNNNYNNYYNNNYNNYNY",502,10,1007,0,9,17,7,"","","","",,"",,,,,,,,"","","","","","",0,0,0,0,,,,,1,3,3,3,,,,,"",,,,,,,,,,"",,"","","","","","","","","","","",,,,,,,"",""
1,9,30,0,1,"03/09/67 00:00:00","ALISON JAYNE","ADAMS","70 JACKMAN CLOSE","ABINGDON","OX143GA","09/11/97 00:00:00","","11/05/97 00:00:00",19833,"NNYNYYYNYYYYNYYYNNYYYNYYYNYNYYNNNYNYYYNNNYNYNNYNNNNNYYNNYYNNNYNNNYNYNNYNNNNYYNNYYNNYYNYNYY",509,12,1207,6,5,18,12,"","","","",,"",,,,,,,,"","","","","","",0,0,0,0,,,,,0,3,3,3,,,,,"",,,,,,,,,,"",,"","","","","","","","","","","",,,,,,,"",""
1,10,31,0,1,"05/20/66 00:00:00","ANNE M","ADAMS","16 BEVERLY CLOSE","ABINGDON","OX141LA","09/11/97 00:00:00","11/05/97 00:00:00","",,"",,,,,,,,"","","","",,"",,,,,,,,"","","","","","",,,,,,,,,,,,,,,,,"",,,,,,,,,,"",,"","","","","","","","","","","",,,,,,,"",""
1,11,41,1,1,"05/23/56 00:00:00","DAVID ALAN","ADAMS","99 ALEXANDER CLOSE","ABINGDON","OX141XD","09/11/97 00:00:00","11/05/97 00:00:00","",,"",,,,,,,,"","","","",,"",,,,,,,,"","","","","","",,,,,,,,,,,,,,,,,"",,,,,,,,,,"",,"","","","","","","","","","","",,,,,,,"",""
1,12,34,1,1,"01/15/63 00:00:00","DAVID JOHN","ADAMS","70 JACKMAN CLOSE","ABINGDON","OX143GA","09/11/97 00:00:00","","11/05/97 00:00:00",19833,"NNYYNNNYYNYYNNYNNNNYYNNYNNNYYNNNNNNNYNYNNYNNNYNYNNYNNNNNYNYNYYNNNNNNYNYNNNNYNNNNYNNNYNNNNY",0,0,1210,6,0,4,5,"","","","",,"",,,,,,,,"","","","","","",0,0,0,0,,,,,2,3,3,3,,,,,"",,,,,,,,,,"",,"","","","","","","","","","","",,,,,,,"",""
1,13,32,1,1,"10/19/65 00:00:00","GEOFFREY","ADAMS","65 LINDSAY DRIVE","ABINGDON","OX142RT","09/11/97 00:00:00","11/05/97 00:00:00","12/11/97 00:00:00",20553,"NYNNYYNNYNYNYNNNYNNNYNYYNNNNYNNNNNYYYNNNNNYYNYNNYNNYNNNYYNNNNYNYNNYNYNYNNNNNNYNNNNNNYYNNYY",57,13,1307,6,9,2,15,"","","","",,"",,,,,,,,"","","","","","",0,0,0,0,,,,,0,0,3,3,,,,,"",,,,,,,,,,"",,"","","","","","","","","","","",,,,,,,"",""
1,14,41,0,1,"11/27/56 00:00:00","MARIA","ADAMS","99 ALEXANDER CLOSE","ABINGDON","OX141XD","09/11/97 00:00:00","11/05/97 00:00:00","",,"",,,,,,,,"","","","",,"",,,,,,,,"","","","","","",,,,,,,,,,,,,,,,,"",,,,,,,,,,"",,"","","","","","","","","","","",,,,,,,"",""
1,15,45,1,1,"05/28/52 00:00:00","RAYMOND C","ADAMS","10 ELIZABETH AVENUE","ABINGDON","OX142NP","09/11/97 00:00:00","11/05/97 00:00:00","",,"",,,,,,,,"","","","",,"",,,,,,,,"","","","","","",,,,,,,,,,,,,,,,,"",,,,,,,,,,"",,"","","","","","","","","","","",,,,,,,"",""
1,16,45,0,1,"10/31/52 00:00:00","LORNA PATRICIA","ADDIS","2 WARWICK CLOSE","ABINGDON","OX142HN","09/11/97 00:00:00","","11/05/97 00:00:00",19991,"NYNNYYNNYYYNYYNNYYYNNNYNNNNNNNNYNYYNYYNYNYNNYNYYYNNYNYNYYYNNYYNNNNNNNYYNYNYNNNNYNNNYNYNYYY",510,81,98,1,14,12,16,"","","","",,"",,,,,,,,"","","","","","",0,0,0,0,,,,,0,0,0,0,,,,,"",,,,,,,,,,"",,"","","","","","","","","","","",,,,,,,"",""
1,17,30,0,1,"06/04/67 00:00:00","JUDITH LESLEY","AGNEW","31 CORMANDEL","ABINGDON","OX145QG","09/11/97 00:00:00","11/05/97 00:00:00","",,"YYYNYYYYYYYYNYNNYYYNNYNYNNYYNNYYNYNNYYYNNNNYNNYYYNYYYNNNYNYNYNNNNNYNNNYNYNNNNNNYYNNYYYNYNY",502,8,810,2,12,12,4,"","","","",,"",,,,,,,,"","","","","","",0,0,0,0,,,,,0,3,3,3,,,,,"",,,,,,,,,,"",,"","","","","","","","","","","",,,,,,,"",""
1,18,33,1,1,"01/09/64 00:00:00","PAUL L","AGNEW","31 CORMANDEL","ABINGDON","OX145QG","09/11/97 00:00:00","","11/05/97 00:00:00",19830,"NYNYNYYYYNYNNYYNYNNNYNYYNNNNNNNYNNNNYNYYNYNYNNNYYNYYYYNNYYNYYNYNNNNNYYYYYNNNNNNYYYNNYNNYYY",506,90,907,1,10,8,4,"","","","",,"",,,,,,,,"","","","","","",0,0,0,0,,,,,0,0,3,3,,,,,"",,,,,,,,,,"",,"","","","","","","","","","","",,,,,,,"",""
1,19,46,1,1,"05/08/51 00:00:00","ROGER CHARLES M","AINSLIE","25 ST AMAND STREET","ABINGDON","OX145RG","09/11/97 00:00:00","11/05/97 00:00:00","",,"",,,,,,,,"","","","",,"",,,,,,,,"","","","","","",,,,,,,,,,,,,,,,,"",,,,,,,,,,"",,"","","","","","","","","","","",,,,,,,"",""
1,20,47,0,1,"07/13/50 00:00:00","SALLY C","AINSLIE","25 ST AMAND STREET","ABINGDON","OX145RG","09/11/97 00:00:00","11/05/97 00:00:00","",,"",,,,,,,,"","","","",,"",,,,,,,,"","","","","","",,,,,,,,,,,,,,,,,"",,,,,,,,,,"",,"","","","","","","","","","","",,,,,,,"",""
1,21,31,1,1,"04/04/66 00:00:00","DOUGLAS JOHN","AITKEN","67 GAINSBOROUGH GREEN","ABINGDON","OX145JL","09/11/97 00:00:00","11/05/97 00:00:00","",,"",,,,,,,,"","","","",,"",,,,,,,,"","","","","","",,,,,,,,,,,,,,,,,"",,,,,,,,,,"",,"","","","","","","","","","","",,,,,,,"",""
1,22,43,1,1,"10/04/54 00:00:00","KEITH J","AITKEN","44 PRESTON ROAD","ABINGDON","OX145LY","09/11/97 00:00:00","11/05/97 00:00:00","",,"",,,,,,,,"","","","",,"",,,,,,,,"","","","","","",,,,,,,,,,,,,,,,,"",,,,,,,,,,"",,"","","","","","","","","","","",,,,,,,"",""
1,23,30,1,1,"02/18/67 00:00:00","KEVIN ROBERT A","AITKEN","7 MARSH COURT","ABINGDON","OX141PS","09/11/97 00:00:00","11/05/97 00:00:00","",,"",,,,,,,,"","","","",,"",,,,,,,,"","","","","","",,,,,,,,,,,,,,,,,"",,,,,,,,,,"",,"","","","","","","","","","","",,,,,,,"",""
1,24,38,0,1,"05/07/59 00:00:00","LYNN M","AITKEN","16 RIVY CLOSE","ABINGDON","OX143XT","09/11/97 00:00:00","11/05/97 00:00:00","",,"",,,,,,,,"","","","",,"",,,,,,,,"","","","","","",,,,,,,,,,,,,,,,,"",,,,,,,,,,"",,"","","","","","","","","","","",,,,,,,"",""
1,25,48,1,1,"11/04/49 00:00:00","NORMAN J","AITKEN","52 PRESTON ROAD","ABINGDON","OX145LY","09/11/97 00:00:00","11/05/97 00:00:00","12/11/97 00:00:00",20553,"NYYNNYYYYYYNYNYNNYNNYNYYNNNNYNYNNYYNYNYNNYNYNNNYNNNNYNNNYYYYYYNNNNYYNNYYYNYYYNNYYNNYYYYYNN",508,10,1104,4,3,15,8,"","","","",,"",,,,,,,,"","","","","","",0,0,0,0,,,,,0,3,0,3,,,,,"",,,,,,,,,,"",,"","","","","","","","","","","",,,,,,,"",""
1,26,37,0,1,"07/04/60 00:00:00","PATRICIA ROSE","AITKEN","67 GAINSBOROUGH GREEN","ABINGDON","OX145JL","09/11/97 00:00:00","11/05/97 00:00:00","",,"",,,,,,,,"","","","",,"",,,,,,,,"","","","","","",,,,,,,,,,,,,,,,,"",,,,,,,,,,"",,"","","","","","","","","","","",,,,,,,"",""
1,27,40,1,1,"12/15/57 00:00:00","RICHARD W","AITKEN","16 RIVY CLOSE","ABINGDON","OX143XT","09/11/97 00:00:00","11/05/97 00:00:00","",,"",,,,,,,,"","","","",,"",,,,,,,,"","","","","","",,,,,,,,,,,,,,,,,"",,,,,,,,,,"",,"","","","","","","","","","","",,,,,,,"",""
1,28,47,0,1,"03/09/50 00:00:00","SHEILA P","AITKEN","52 PRESTON ROAD","ABINGDON","OX145LY","09/11/97 00:00:00","","11/05/97 00:00:00",19836,"YYYNNYYNYNYNYNNNYYYYYNYNNNNYYNYNNYYNYYNYNYNNNNYNYNNNYNNNYYNYYYNYNNNNNNYYNNYNYYNYNYNYYYYYYY",502,10,1102,1,8,16,18,"","","","",,"",,,,,,,,"","","","","","",0,0,0,0,,,,,0,0,0,0,,,,,"",,,,,,,,,,"",,"","","","","","","","","","","",,,,,,,"",""
1,29,32,0,1,"09/28/65 00:00:00","AMANDA DOROTHY","AKERS","35 HAWKINS WAY","WOOTTON","OX136LD","09/11/97 00:00:00","11/05/97 00:00:00","",,"",,,,,,,,"","","","",,"",,,,,,,,"","","","","","",,,,,,,,,,,,,,,,,"",,,,,,,,,,"",,"","","","","","","","","","","",,,,,,,"",""
1,30,42,1,1,"01/06/55 00:00:00","DAVID JOHN","AKERS","25 KENNET ROAD","ABINGDON","OX143ST","09/11/97 00:00:00","11/05/97 00:00:00","",,"",,,,,,,,"","","","",,"",,,,,,,,"","","","","","",,,,,,,,,,,,,,,,,"",,,,,,,,,,"",,"","","","","","","","","","","",,,,,,,"",""
1,31,34,1,1,"06/05/63 00:00:00","PAUL CHRISTOPHER","AKERS","35 HAWKINS WAY","WOOTTON","OX136LD","09/11/97 00:00:00","11/05/97 00:00:00","",,"",,,,,,,,"","","","",,"",,,,,,,,"","","","","","",,,,,,,,,,,,,,,,,"",,,,,,,,,,"",,"","","","","","","","","","","",,,,,,,"",""
1,32,41,0,1,"08/13/56 00:00:00","SUSAN GRACE","AKERS","25 KENNET ROAD","ABINGDON","OX143ST","09/11/97 00:00:00","","11/05/97 00:00:00",19820,"NNYNNYYNYNYNYNYNNYYYYNYNNNYNYNNNNYYNYYNNYYNNBNNYNNYNYNNNYYNNYNYNNNNNYNYNYNNNNYNYYYNNYNNYYY",506,8,10,1,1,12,13,"","","","",,"",,,,,,,,"","","","","","",0,1,0,0,,,,,1,2,3,0,,,,,"",,,,,,,,,,"",,"","","","","","","","","","","",,,,,,,"",""
1,33,35,1,1,"08/09/62 00:00:00","MAQSOOD","AKHTAR","47 WILSHAM ROAD","ABINGDON","OX145LO","09/11/97 00:00:00","11/05/97 00:00:00","12/10/97 00:00:00",20537,"YYYYYYNNYNYYYNNNYYYNYYYYNNNNNNNNNYYYYYNNYYNNYNYNNNNNYYYYYNYYNYYNNNYNYYYYYNYNNNNYYYNYYNYYYY",511,13,1400,4,10,15,11,"","","","",,"",,,,,,,,"","","","","","",0,0,0,0,,,,,2,3,3,3,,,,,"",,,,,,,,,,"",,"","","","","","","","","","","",,,,,,,"",""
1,34,39,1,1,"11/13/58 00:00:00","PAUL ROBERT","AKID","27 BALLARD CHASE","ABINGDON","OX141XQ","09/11/97 00:00:00","11/05/97 00:00:00","",,"",,,,,,,,"","","","",,"",,,,,,,,"","","","","","",,,,,,,,,,,,,,,,,"",,,,,,,,,,"",,"","","","","","","","","","","",,,,,,,"",""
1,35,35,0,1,"01/27/62 00:00:00","PENELOPE ROSE","AKID","27 BALLARD CHASE","ABINGDON","OX141XQ","09/11/97 00:00:00","11/05/97 00:00:00","",,"",,,,,,,,"","","","",,"",,,,,,,,"","","","","","",,,,,,,,,,,,,,,,,"",,,,,,,,,,"",,"","","","","","","","","","","",,,,,,,"",""
1,36,41,1,1,"12/31/56 00:00:00","JAMAL S","AL-AWFI","ABINGDON COLLEGE","NORTHCOURT ROAD","OX141NW","09/11/97 00:00:00","11/05/97 00:00:00","",,"",,,,,,,,"","","","",,"",,,,,,,,"","","","","","",,,,,,,,,,,,,,,,,"",,,,,,,,,,"",,"","","","","","","","","","","",,,,,,,"",""
1,37,38,1,1,"01/01/59 00:00:00","HAMED SULEAMAN","AL-SHURAIQI","47 WEST ST HELEN STREET","ABINGDON","OX145BT","09/11/97 00:00:00","11/05/97 00:00:00","",,"",,,,,,,,"","","","",,"",,,,,,,,"","","","","","",,,,,,,,,,,,,,,,,"",,,,,,,,,,"",,"","","","","","","","","","","",,,,,,,"",""
1,38,38,0,1,"09/30/59 00:00:00","PHYLLIS T","ALABASTER","BESSELSLEIGH SCHOOL","BESSELSLEIGH","OX135QB","09/11/97 00:00:00","11/05/97 00:00:00","01/09/98 00:00:00",21101,"YYNNYYNNNYYYYNNNNYYYYNNYNNNNYNNYNNYYYNNNNNNNYNNNNNNNYNNYYNNYNNNYNYNNYNYYNNNNNYNYYNNNNYNYYY",503,98,1000,2,11,6,17,"","","","",,"",,,,,,,,"","","","","","",0,0,0,0,,,,,4,3,3,0,,,,,"",,,,,,,,,,"",,"","","","","","","","","","","",,,,,,,"",""
1,39,48,1,1,"02/21/49 00:00:00","CLIVE E","ALCOCK","CROFTDOWN","OXFORD ROAD","OX135NN","09/11/97 00:00:00","11/05/97 00:00:00","",,"",,,,,,,,"","","","",,"",,,,,,,,"","","","","","",,,,,,,,,,,,,,,,,"",,,,,,,,,,"",,"","","","","","","","","","","",,,,,,,"",""
1,40,45,0,1,"02/21/52 00:00:00","JILL FAITH","ALCOCK","CROFTDOWN","OXFORD ROAD","OX135NN","09/11/97 00:00:00","11/05/97 00:00:00","",,"",,,,,,,,"","","","",,"",,,,,,,,"","","","","","",,,,,,,,,,,,,,,,,"",,,,,,,,,,"",,"","","","","","","","","","","",,,,,,,"",""
1,41,48,0,1,"07/22/49 00:00:00","SARA J","ALDEN","BROOMHILL","LINCOMBE LANE","OX15DZ","09/11/97 00:00:00","11/05/97 00:00:00","",,"",,,,,,,,"","","","",,"",,,,,,,,"","","","","","",,,,,,,,,,,,,,,,,"",,,,,,,,,,"",,"","","","","","","","","","","",,,,,,,"",""
1,42,41,1,1,"12/01/56 00:00:00","ALEC JOHN","ALDER","39 WHITELOCK ROAD","ABINGDON","OX141PA","09/11/97 00:00:00","","11/05/97 00:00:00",19818,"YDYNYYYYNDYYYYNNYNDNNNNYYNNNNNNYNNNYYNYDNNNDYNNNDNYYYDNYNYNYYNYNNNYDYYYDDYDNNDNNYDNDYYNYYY",562,0,17,5,16,5,7,"","","","",,"",,,,,,,,"","","","","","",1,4,6,3,,,,,0,3,3,0,,,,,"",,,,,,,,,,"",,"","","","","","","","","","","",,,,,,,"",""
1,43,46,0,1,"09/07/51 00:00:00","CAROLINE M","ALDER","5 NASH DRIVE","ABINGDON","OX145PT","09/11/97 00:00:00","","11/05/97 00:00:00",19830,"NYNNYYNNYNYYNYNNYNNNNNNYYNNNNNNYNNNNYNYNNNNYNYNYNNNYYNNNYNYNYNNNNNYNYNYNNNNNNNNYYNNNYNNNNY",557,92,1200,3,9,2,7,"","","","",,"",,,,,,,,"","","","","","",0,0,0,0,,,,,1,3,3,3,,,,,"",,,,,,,,,,"",,"","","","","","","","","","","",,,,,,,"",""
1,44,32,0,1,"03/28/65 00:00:00","CHARMAIN DENISE","ALDER","13 GOLAFRE ROAD","ABINGDON","OX145HH","09/11/97 00:00:00","11/05/97 00:00:00","",,"",,,,,,,,"","","","",,"",,,,,,,,"","","","","","",,,,,,,,,,,,,,,,,"",,,,,,,,,,"",,"","","","","","","","","","","",,,,,,,"",""
1,45,46,1,1,"03/20/51 00:00:00","CHRISTOPHER JOHN","ALDER","STARVEALL FARMHOUSE","WHITECROSS","OX136BS","09/11/97 00:00:00","11/05/97 00:00:00","",,"",,,,,,,,"","","","",,"",,,,,,,,"","","","","","",,,,,,,,,,,,,,,,,"",,,,,,,,,,"",,"","","","","","","","","","","",,,,,,,"",""
1,46,38,1,1,"11/17/59 00:00:00","DAVID CHARLES","ALDER","39 WHITELOCK ROAD","ABINGDON","OX141PA","09/11/97 00:00:00","11/05/97 00:00:00","",,"",,,,,,,,"","","","",,"",,,,,,,,"","","","","","",,,,,,,,,,,,,,,,,"",,,,,,,,,,"",,"","","","","","","","","","","",,,,,,,"",""
1,47,38,0,1,"05/15/59 00:00:00","ISOBEL LINDSEY","ALDER","STARVEALL FARMHOUSE","WHITECROSS","OX136BS","09/11/97 00:00:00","11/05/97 00:00:00","",,"",,,,,,,,"","","","",,"",,,,,,,,"","","","","","",,,,,,,,,,,,,,,,,"",,,,,,,,,,"",,"","","","","","","","","","","",,,,,,,"",""
1,48,35,1,1,"04/30/62 00:00:00","JOHN M","ALDER","13 GOLAFRE ROAD","ABINGDON","OX145HH","09/11/97 00:00:00","11/05/97 00:00:00","",,"",,,,,,,,"","","","",,"",,,,,,,,"","","","","","",,,,,,,,,,,,,,,,,"",,,,,,,,,,"",,"","","","","","","","","","","",,,,,,,"",""
1,49,32,1,1,"12/16/65 00:00:00","JONATHAN","ALDER","10 ELIZABETH AVENUE","ABINGDON","OX142NP","09/11/97 00:00:00","11/05/97 00:00:00","",,"",,,,,,,,"","","","",,"",,,,,,,,"","","","","","",,,,,,,,,,,,,,,,,"",,,,,,,,,,"",,"","","","","","","","","","","",,,,,,,"",""
1,50,33,0,1,"09/17/64 00:00:00","MANDY ANN","ALDER","10 ELIZABETH AVENUE","ABINGDON","OX142NP","09/11/97 00:00:00","11/05/97 00:00:00","",,"",,,,,,,,"","","","",,"",,,,,,,,"","","","","","",,,,,,,,,,,,,,,,,"",,,,,,,,,,"",,"","","","","","","","","","","",,,,,,,"",""
1,51,36,1,1,"01/02/61 00:00:00","MARTIN GEORGE","ALDER","5 JOHN MASON ROAD","ABINGDON","OX142EN","09/11/97 00:00:00","11/05/97 00:00:00","",,"",,,,,,,,"","","","",,"",,,,,,,,"","","","","","",,,,,,,,,,,,,,,,,"",,,,,,,,,,"",,"","","","","","","","","","","",,,,,,,"",""
1,52,36,1,1,"02/02/61 00:00:00","MARTIN TOM","ALDER","39 WHITELOCK ROAD","ABINGDON","OX141PA","09/11/97 00:00:00","11/05/97 00:00:00","",,"",,,,,,,,"","","","",,"",,,,,,,,"","","","","","",,,,,,,,,,,,,,,,,"",,,,,,,,,,"",,"","","","","","","","","","","",,,,,,,"",""
1,53,31,1,1,"12/09/66 00:00:00","MICHAEL JOHN","ALDER","177 SOUTH AVENUE","ABINGDON","OX141QX","09/11/97 00:00:00","","11/05/97 00:00:00",19820,"YYYNNYYNYNYNNYYNNNNYYNYYYYNYNYNNYYNYNNNNYNNYNYNYYYYNYNNYYNYYYNYYYYNNYNNNYNNNNNNYYNYYYNBYNY",510,11,0,10,10,10,5,"","","","",,"",,,,,,,,"","","","","","",1,0,0,0,,,,,0,0,0,0,,,,,"",,,,,,,,,,"",,"","","","","","","","","","","",,,,,,,"",""
1,54,34,1,1,"08/24/63 00:00:00","PETER ROBERT","ALDER","54 VIRGINIA WAY","ABINGDON","OX145QL","09/11/97 00:00:00","11/05/97 00:00:00","",,"",,,,,,,,"","","","",,"",,,,,,,,"","","","","","",,,,,,,,,,,,,,,,,"",,,,,,,,,,"",,"","","","","","","","","","","",,,,,,,"",""
1,55,50,0,1,"08/04/47 00:00:00","SUSAN","ALDER","14 GOLAFRE ROAD","ABINGDON","OX145HH","09/11/97 00:00:00","11/05/97 00:00:00","",,"",,,,,,,,"","","","",,"",,,,,,,,"","","","","","",,,,,,,,,,,,,,,,,"",,,,,,,,,,"",,"","","","","","","","","","","",,,,,,,"",""
1,56,40,1,1,"05/16/57 00:00:00","NEIL J","ALDERMAN","65 CURTIS AVENUE","ABINGDON","OX143UN","09/11/97 00:00:00","11/05/97 00:00:00","",,"",,,,,,,,"","","","",,"",,,,,,,,"","","","","","",,,,,,,,,,,,,,,,,"",,,,,,,,,,"",,"","","","","","","","","","","",,,,,,,"",""
1,57,33,0,1,"09/16/64 00:00:00","RACHEL","ALDERMAN","65 CURTIS AVENUE","ABINGDON","OX143UN","09/11/97 00:00:00","11/05/97 00:00:00","",,"",,,,,,,,"","","","",,"",,,,,,,,"","","","","","",,,,,,,,,,,,,,,,,"",,,,,,,,,,"",,"","","","","","","","","","","",,,,,,,"",""
1,58,47,0,1,"04/27/50 00:00:00","JANET IRENE","ALDRIDGE","44 EATON ROAD","APPLETON","OX135JH","09/11/97 00:00:00","11/05/97 00:00:00","",,"",,,,,,,,"","","","",,"",,,,,,,,"","","","","","",,,,,,,,,,,,,,,,,"",,,,,,,,,,"",,"","","","","","","","","","","",,,,,,,"",""
1,59,49,1,1,"03/26/48 00:00:00","MARTIN FREDERICK","ALDRIDGE","44 EATON ROAD","APPLETON","OX135JH","09/11/97 00:00:00","11/05/97 00:00:00","",,"",,,,,,,,"","","","",,"",,,,,,,,"","","","","","",,,,,,,,,,,,,,,,,"",,,,,,,,,,"",,"","","","","","","","","","","",,,,,,,"",""
1,60,41,0,1,"08/11/56 00:00:00","JANE ELIZABETH","ALDWORTH","51 RADLEY ROAD","ABINGDON","OX143PL","09/11/97 00:00:00","11/05/97 00:00:00","",,"",,,,,,,,"","","","",,"",,,,,,,,"","","","","","",,,,,,,,,,,,,,,,,"",,,,,,,,,,"",,"","","","","","","","","","","",,,,,,,"",""
1,61,45,1,1,"01/23/52 00:00:00","PETER J","ALDWORTH","FLAT 6 BISHOPSTOW","WEST ST HELENS STREET","OX145BP","09/11/97 00:00:00","11/05/97 00:00:00","",,"",,,,,,,,"","","","",,"",,,,,,,,"","","","","","",,,,,,,,,,,,,,,,,"",,,,,,,,,,"",,"","","","","","","","","","","",,,,,,,"",""
1,62,45,1,1,"01/04/52 00:00:00","PETER WILLIAM","ALDWORTH","51 RADLEY ROAD","ABINGDON","OX143PL","09/11/97 00:00:00","11/05/97 00:00:00","",,"",,,,,,,,"","","","",,"",,,,,,,,"","","","","","",,,,,,,,,,,,,,,,,"",,,,,,,,,,"",,"","","","","","","","","","","",,,,,,,"",""
1,63,31,1,1,"06/21/66 00:00:00","NICHOLAS P","ALEXANDER","4 MIDGET CLOSE","ABINGDON","OX145NR","09/11/97 00:00:00","11/05/97 00:00:00","",,"",,,,,,,,"","","","",,"",,,,,,,,"","","","","","",,,,,,,,,,,,,,,,,"",,,,,,,,,,"",,"","","","","","","","","","","",,,,,,,"",""
1,64,46,1,1,"12/19/51 00:00:00","TERRY W","ALFORD","63A MATTHEWS WAY","WOOTTON","OX136JU","09/11/97 00:00:00","11/05/97 00:00:00","",,"",,,,,,,,"","","","",,"",,,,,,,,"","","","","","",,,,,,,,,,,,,,,,,"",,,,,,,,,,"",,"","","","","","","","","","","",,,,,,,"",""
1,65,40,1,1,"07/27/57 00:00:00","SALMA","ALGEBALI","58 SADLERS COURT","ABINGDON","OX142PA","09/11/97 00:00:00","11/05/97 00:00:00","",,"YYBNNYNNNYYNYNYNYDYYDNNNYNNNYNNNNYYYYYDYNYNYYNDYNNNYNYDDNYNYYYNYNNNDNYYNNYNNYYNNDNNNDYNYYY",160,60,0,4,12,9,15,"","","","",,"",,,,,,,,"","","","","","",1,2,3,4,,,,,0,2,0,0,,,,,"",,,,,,,,,,"",,"","","","","","","","","","","",,,,,,,"",""
1,66,30,1,1,"04/27/67 00:00:00","ASHOK","ALI","26 FRANCIS LITTLE DRIVE","ABINGDON","OX145PN","09/11/97 00:00:00","11/05/97 00:00:00","",,"",,,,,,,,"","","","",,"",,,,,,,,"","","","","","",,,,,,,,,,,,,,,,,"",,,,,,,,,,"",,"","","","","","","","","","","",,,,,,,"",""
1,67,32,0,1,"11/21/65 00:00:00","DONNA LISA C","ALI","6 GARFORD CLOSE","ABINGDON","OX142BY","09/11/97 00:00:00","11/05/97 00:00:00","",,"",,,,,,,,"","","","",,"",,,,,,,,"","","","","","",,,,,,,,,,,,,,,,,"",,,,,,,,,,"",,"","","","","","","","","","","",,,,,,,"",""
1,68,35,0,1,"11/24/62 00:00:00","ELENI","ALIFERI","20A MIDWINTER AVENUE","MILTON HEIGHTS","OX144XB","09/11/97 00:00:00","11/05/97 00:00:00","",,"",,,,,,,,"","","","",,"",,,,,,,,"","","","","","",,,,,,,,,,,,,,,,,"",,,,,,,,,,"",,"","","","","","","","","","","",,,,,,,"",""
1,69,39,0,1,"01/28/58 00:00:00","ELSPETH A","ALLAN","3 STEVENSON SRIVE","ABINGDON","OX141SN","09/11/97 00:00:00","","11/05/97 00:00:00",19829,"YYYNYYNYYYYNNYYNNYYNNNYNYNNNYNNYNYNNYNYNYNNYNNNYYNYYYNYYYNNNYNNNNNNNNNYYYNNNNNNYNYNNYYNYYY",503,90,1007,0,13,9,10,"","","","",,"",,,,,,,,"","","","","","",0,0,0,0,,,,,1,3,3,3,,,,,"",,,,,,,,,,"",,"","","","","","","","","","","",,,,,,,"",""
1,70,42,1,1,"05/27/55 00:00:00","IAIN S","ALLAN","3 STEVENSON SRIVE","ABINGDON","OX141SN","09/11/97 00:00:00","","11/05/97 00:00:00",19986,"NYYYNYYYNYYYYNYNNYNNNNYYNNYYNYNNNNNNYNYYYNNYNYNYNNYYNYNYYNYYYNYYYNNYNNNYYYYYYNYYYNYYYYNYNY",511,80,84,10,10,15,3,"","","","",,"",,,,,,,,"","","","","","",0,0,0,0,,,,,0,3,0,0,,,,,"",,,,,,,,,,"",,"","","","","","","","","","","",,,,,,,"",""
1,71,46,1,1,"05/21/51 00:00:00","JOHN N","ALLAN","29 EASON DRIVE","ABINGDON","OX143YD","09/11/97 00:00:00","","11/05/97 00:00:00",19847,"NYNNYYNYYNYNNYNNYNNNNNNYNNNYNNNYNNNYYNYNNNNYNYYYNNNYYYNNNYNNYNYNNYYNYNYYYYNNNNNYYYNNYNNNYY",600,13,1556,5,10,6,5,"06/04/00 00:00:00","","","",,"",,,,,,,,"","","","","","",0,0,0,0,,,,,3,3,3,3,,,,,"",,,,,,,,,,"",,"","","","","","","","","","","",,,,,,,"","01/01/00 00:00:00"
1,72,49,0,1,"03/08/48 00:00:00","JUDITH MARY","ALLAN","THE BARN","CHURCH STREET","OX144NJ","09/11/97 00:00:00","11/05/97 00:00:00","",,"",,,,,,,,"","","","",,"",,,,,,,,"","","","","","",,,,,,,,,,,,,,,,,"",,,,,,,,,,"",,"","","","","","","","","","","",,,,,,,"",""
1,73,42,0,1,"01/12/55 00:00:00","SHARON ANNE","ALLAN","29 EASON DRIVE","ABINGDON","OX143YD","09/11/97 00:00:00","","11/05/97 00:00:00",19824,"YYYNYYYNYNYYYYYNYYYYYNYNNNYNNNYYNYNNYYYNYNNNNNNYYNYYYYYNYYNNYYNYNYNYNNYYYNYNYNNYYNNYYNNYYY",511,10,1006,0,10,22,13,"","","","",,"",,,,,,,,"","","","","","",0,0,0,0,,,,,1,3,3,3,,,,,"",,,,,,,,,,"",,"","","","","","","","","","","",,,,,,,"",""
1,74,48,1,1,"10/26/49 00:00:00","TERENCE S","ALLAN","1 TOWNSEND","ABINGDON","OX145LG","09/11/97 00:00:00","","11/05/97 00:00:00",19827,"YYYNNYYNYNYNYNNNNYYNYNYNYNNYNNNYNNNYYNYNNYNNNNYYYNYYYNNYYYNYYYNYNYYNYNYNYYNNYYNNYNNNYNNYYY",504,710,1005,2,10,10,10,"","","","",,"",,,,,,,,"","","","","","",0,0,0,0,,,,,2,3,3,3,,,,,"",,,,,,,,,,"",,"","","","","","","","","","","",,,,,,,"",""